{"text_format":"1","workbook":"xlsx","n_sheets":3,"sheets":["Formulario","RES_AF subv","Exp Únicos"],"not_rendered":{"charts":0,"images":2,"macros":1,"external_links":0,"defined_names":3,"comments":0,"pivot_tables":0},"unopened":[],"bounds":{"document_bytes":16777216,"sheet_cells":100000,"rows_first":2000,"rows_last":500,"rows_between":2000,"halvings":0,"cell_chars":16384,"cell_head_chars":4096},"cells_cut":0,"cells_raw":0,"read":"whole","date_system":"1900"}

{"sheet":"Formulario","index":0,"n_rows":50,"n_cols":5,"rows_kept":50,"cut":false,"hidden":false,"merged":[[5,1,5,4],[6,1,6,4],[10,1,10,4],[14,1,14,4],[17,1,17,4],[7,2,7,4],[8,2,8,4],[9,2,9,4],[11,2,11,4],[12,2,12,4],[13,2,13,4],[15,2,15,4],[16,2,16,4],[21,1,21,4],[18,2,18,4],[19,2,19,4],[20,2,20,4],[35,1,35,4],[36,1,36,4],[22,2,22,4],[23,2,23,4],[24,2,24,4],[44,1,44,4],[37,1,37,4],[38,1,38,4],[39,1,39,4],[40,1,40,4],[41,1,42,4],[43,1,43,4],[25,1,25,4]]}
[null,null,null,"            Una vez cumplimentado, convertir a pdf →"]
[]
[]
[]
[]
[null,"COMUNICACIÓN DE SUBCONTRATACIÓN"]
[null,"DATOS DEL BENEFICIARIO "]
[null,{"$f":"IF(C8=\"\",\"Seleccciona un Expediente ->\",\"Expediente:\")","v":"Seleccciona un Expediente ->"}]
[null,"Beneficiario:",{"$f":"IF($C$8=\"\",\"\",VLOOKUP($C$8,'RES_AF subv'!$B$2:$G$63,2,0))","v":""}]
[null,"NIF:",{"$f":"IF($C$8=\"\",\"\",VLOOKUP($C$8,'RES_AF subv'!$B$2:$G$63,3,0))","v":""}]
[null,"DATOS DE LA ACCIÓN FORMATIVA"]
[null,"Código herramienta gestión subvenciones:",{"$f":"IF(C14=\"\",\"\",_xlfn.XLOOKUP(C14,'Exp Únicos'!$I$2:$I$10,'Exp Únicos'!$J$2:$J$10))","v":""}]
[null,"ID Acción Formativa:",{"$f":"IF($C$14=\"\",\"\",_xlfn.XLOOKUP(C14,'Exp Únicos'!$I$2:$I$10,'Exp Únicos'!$H$2:$H$10))","v":""}]
[null,{"$f":"IF(AND($C$8<>\"\",$C$14=\"\"),\"Selecciona la Acción ->\",\"Denominación Acción Formativa:\")","v":"Denominación Acción Formativa:"}]
[null,"ACTIVIDAD SUBCONTRATADA"]
[null,"Descripción de la actividad concertada con terceros:"]
[null,"Descripción de los gastos subvencionables subcontratados (artículo 9 de la Orden TMA/780/2022, de 21 de julio):"]
[null,"DATOS DEL CONTRATISTA"]
[null,"NIF:"]
[null,"Nombre o razón social:"]
[null,"Domicilio fiscal:"]
[null,"DATOS DEL SUBCONTRATISTA (EN SU CASO)"]
[null,"NIF:"]
[null,"Nombre o razón social:"]
[null,"Domicilio fiscal:"]
[null,"DOCUMENTACIÓN ADJUNTA A PRESENTAR"]
[]
[]
[]
[null,"F01_C19_22_UNI_IT_SUBCONTRATACION Edición 1",null,null,"Página 1 de 2"]
[]
[]
[]
[]
[]
[null,"COMUNICACIÓN DE SUBCONTRATACIÓN"]
[null,"-        Aceptación de los contratistas/subcontratistas de la cesión de datos entre las Administraciones Públicas implicadas para dar cumplimiento a lo previsto en la normativa europea que es de aplicación y de conformidad con la Ley Orgánica 3/2018, de 5 de diciembre, de Protección de Datos Personales y garantía de los derechos digitales (F03_C19_22_UNI_IT_SUBCONTRATACION)"]
[null,"-        Declaración responsable de los contratistas/subcontratistas relativa al compromiso de cumplimiento de los principios transversales establecidos en el Plan de Recuperación y que pudieran afectar al ámbito objeto de gestión (F04_C19_22_UNI_IT_SUBCONTRATACION)"]
[null,"-        Declaración de Ausencia de Conflicto de Intereses (DACI) contratistas/subcontratistas (F05_C19_22_UNI_IT_SUBCONTRATACION)"]
[null,"-        Documento acreditativo de la inscripción en el Censo de empresarios, profesionales y retenedores de la Agencia Estatal de la Administración Tributaria o en el Censo equivalente de la Administración Tributaria Foral, que debe reflejar la actividad efectivamente desarrollada en la fecha de participación en el procedimiento de licitación"]
[null,"OTROS DATOS\n(OPCIONAL)"]
[]
[]
[null,"REPRESENTANTE LEGAL"]
[null,"La entidad beneficiaria declara que cumple con los requisitos establecidos en la Ley 38/2003, de 17 de noviembre, General de Subvenciones y su Reglamento de aplicación, en la Orden TMA/780/2022, de 21 de julio, y en la Convocatoria en 2022, en materia de subcontratación."]
[null,"Nombre y \nApellidos",null,"Firma electrónica"]
[]
[]
[]
[null,"F01_C19_22_UNI_IT_SUBCONTRATACION Edición 1",null,null,"Página 2 de 2"]

{"sheet":"RES_AF subv","index":1,"n_rows":65,"n_cols":21,"rows_kept":65,"cut":false,"hidden":true,"merged":[[0,0,0,7],[0,8,0,17],[0,18,0,20]]}
["DATOS GENERALES",null,null,null,null,null,null,null,"PUNTUACIÓN CRITERIOS DE VALORACIÓN",null,null,null,null,null,null,null,null,null,"PRESUPUESTO Y SUBVENCIÓN"]
["SS","Expediente","Beneficiario","NIF","Id Acción Formativa","Denominación Acción Formativa","Código herramienta gestión subvenciones","Código ficha resumen","A.1","A.2","A.3","A.4","Total A","B","C","D","E","TOTAL","Presupuesto solicitado","Intensidad de ayuda aplicable (IAAF)","Subvención concedida"]
[1,"C19_PR/22/00006","CENTRO DE ENSEÑANZA UNIVERSITARIA SEK","A79336947","AF01","Logística urbana inteligente de mercancías","C19_PR/22/00006-P01_L1_C19-20221014-1","AF1",25,25,0,5,50,15,15,10,10,100,750000,750000,750000]
[11,"C19_PR/22/00006","CENTRO DE ENSEÑANZA UNIVERSITARIA SEK","A79336947","AF02","Logística urbana inteligente de mercancías","C19_PR/22/00006-P02_L1_C19-20221031-1","AF2",25,25,0,5,50,0,15,10,10,85,500000,500000,500000]
[3,"C19_PR/22/00006","CENTRO DE ENSEÑANZA UNIVERSITARIA SEK","A79336947","AF03","Industria 4.0 aplicado a la industria aeronáutica y del transporte","C19_PR/22/00006-P03_L1_C19-20221102-1","AF3",25,25,0,5,50,15,15,10,10,100,200000,200000,200000]
[5,"C19_PR/22/00007","UNIVERSIDADE DE VIGO","Q8650002B","AF01","Experto/a en transformación ágil de organizaciones","C19_PR/22/00007-P01_L1_C19-20221103-1","ESEI1LIA2",25,25,0,5,50,15,15,5,10,95,207600,207600,207600]
[5,"C19_PR/22/00007","UNIVERSIDADE DE VIGO","Q8650002B","AF02","Experto/a en infraestructuras de datos aplicados al sector del transporte","C19_PR/22/00007-P02_L1_C19-20221103-1","ESEI2LIA2",25,25,10,5,50,15,15,5,10,95,207600,207600,207600]
[5,"C19_PR/22/00007","UNIVERSIDADE DE VIGO","Q8650002B","AF03","Experto/a en digitalización del sector transporte y logística","C19_PR/22/00007-P03_L1_C19-20221103-1","ESEI3LIA2",25,25,10,5,50,15,15,5,10,95,207600,207600,207600]
[5,"C19_PR/22/00007","UNIVERSIDADE DE VIGO","Q8650002B","AF04","Experto en comunicación digital para la movilidad","C19_PR/22/00007-P04_L1_C19-20221103-1","ESEI4LIA2",25,25,0,5,50,15,15,5,10,95,207600,207600,207600]
[30,"C19_PR/22/00009","UNIVERSIDAD DE CANTABRIA","Q3918001C","AF04","Experto en herramientas digitales para planificación y gestión de movilidad urbana sostenible","C19_PR/22/00009-P04_L1_C19-20221102-1","P04_L1_C19-20221102-1",25,10,0,5,40,15,10,5,0,70,150000,150000,150000]
[2,"C19_PR/22/00011","UNIVERSIDAD DE ALCALA","Q2818018J","AF01","Competencias Digitales para la Transformación 4.0 en Transporte y Logística","C19_PR/22/00011-P01_L1_C19-20221026-1","FC73",25,25,0,5,50,15,15,10,10,100,222000,222000,222000]
[34,"C19_PR/22/00011","UNIVERSIDAD DE ALCALA","Q2818018J","AF02","Simulación y optimización de redes logísticas, transporte y cadenas de suministro con gemelos digitales","C19_PR/22/00011-P02_L1_C19-20221102-1","FC74",25,10,0,5,40,0,15,10,0,65,240000,240000,240000]
[21,"C19_PR/22/00011","UNIVERSIDAD DE ALCALA","Q2818018J","AF03","Tecnologías para la capacitación digital en el sector del transporte","C19_PR/22/00011-P03_L1_C19-20221102-1","FC75",25,25,0,5,50,15,5,5,0,75,100000,100000,100000]
[18,"C19_PR/22/00011","UNIVERSIDAD DE ALCALA","Q2818018J","AF05","Técnicas de deep learning y control aplicadas a sistemas inteligentes de transporte","C19_PR/22/00011-P05_L1_C19-20221103-1","FC77",25,10,0,5,40,15,10,5,10,80,180000,180000,180000]
[27,"C19_PR/22/00014","UNIVERSITAT POLITÈCNICA DE CATALUNYA","Q0818003F","AF01","Data Science and Digital Technologies for Fleet Tracking and Management","C19_PR/22/00014-P01_L1_C19-20221103-1","EETAC1",25,25,0,5,50,15,5,0,0,70,105000,105000,105000]
[27,"C19_PR/22/00014","UNIVERSITAT POLITÈCNICA DE CATALUNYA","Q0818003F","AF02","Urban Air Mobility: Integrating U-Space technologies and services","C19_PR/22/00014-P02_L1_C19-20221103-1","EETAC2",25,25,10,5,50,15,5,0,0,70,105000,105000,105000]
[26,"C19_PR/22/00014","UNIVERSITAT POLITÈCNICA DE CATALUNYA","Q0818003F","AF03","Digitalización de la movilidad urbana","C19_PR/22/00014-P03_L1_C19-20221103-1","ETSECCPB1",25,25,10,5,50,15,5,0,0,70,108000,108000,108000]
[26,"C19_PR/22/00014","UNIVERSITAT POLITÈCNICA DE CATALUNYA","Q0818003F","AF04","Smart Road Transporte. Digitalización del sector del transporte de mercancías","C19_PR/22/00014-P04_L1_C19-20221103-1","ETSECCPB2",25,25,10,5,50,15,5,0,0,70,108000,108000,108000]
[20,"C19_PR/22/00014","UNIVERSITAT POLITÈCNICA DE CATALUNYA","Q0818003F","AF05","Puertos 4.0. Digitalización de la logística y gestión portuarias","C19_PR/22/00014-P05_L1_C19-20221103-1","ETSECCPB3",25,25,0,5,50,15,10,0,0,75,157500,157500,157500]
[16,"C19_PR/22/00014","UNIVERSITAT POLITÈCNICA DE CATALUNYA","Q0818003F","AF06","Smart City y gestión de la movilidad. Un enfoque multidisciplinar","C19_PR/22/00014-P06_L1_C19-20221103-1","ETSECCPB4",25,25,10,5,50,15,5,0,10,80,105000,105000,105000]
[32,"C19_PR/22/00016","UNIVERSIDAD DEL PAÍS VASCO/EUSKAL HERRIKO UNIBERTSITATEA","Q4818001B","AF01","Simulación digital de la cadena logística integral","C19_PR/22/00016-P01_L1_C19-20221031-1","SIMULOG",25,0,0,5,30,15,10,5,10,70,85125,85125,85125]
[27,"C19_PR/22/00016","UNIVERSIDAD DEL PAÍS VASCO/EUSKAL HERRIKO UNIBERTSITATEA","Q4818001B","AF02","Máster propio. Digital Management & ERP: Gestión de la empresa 4.0","C19_PR/22/00016-P02_L1_C19-20221031-1","DIGMANAGEMENT",25,25,10,5,50,15,5,0,0,70,105000,105000,105000]
[36,"C19_PR/22/00016","UNIVERSIDAD DEL PAÍS VASCO/EUSKAL HERRIKO UNIBERTSITATEA","Q4818001B","AF03","Especialización universitaria. Gestión digital de la empresa","C19_PR/22/00016-P03_L1_C19-20221031-1","GESTDIGEMP",25,0,10,5,40,15,5,0,0,60,76341.320000000007,76341.320000000007,76341.320000000007]
[41,"C19_PR/22/00016","UNIVERSIDAD DEL PAÍS VASCO/EUSKAL HERRIKO UNIBERTSITATEA","Q4818001B","AF04","Especialización universitaria. Sistemas para la gestión empresarial - ERP","C19_PR/22/00016-P04_L1_C19-20221031-1","SISTGESTEMPR",25,0,0,5,30,15,5,0,0,50,76341.320000000007,76341.320000000007,76341.320000000007]
[10,"C19_PR/22/00018","UNIVERSIDAD AUTÓNOMA DE MADRID","Q2818013A","AF01","Curso en Business Analytics, transformación digital y transporte","C19_PR/22/00018-P01_L1_C19-20221102-1","P01_L1_C19-20221102-1",25,25,10,5,50,15,15,5,0,85,196504,196504,196504]
[4,"C19_PR/22/00020","UNIVERSIDAD DE CASTILLA-LA MANCHA","Q1368009E","AF01","Especialista en gestión digital de logística y transporte","C19_PR/22/00020-P01_L1_C19-20221102-1","AF-UCLM1",25,25,0,5,50,15,15,5,10,95,240000,240000,240000]
[4,"C19_PR/22/00020","UNIVERSIDAD DE CASTILLA-LA MANCHA","Q1368009E","AF02","Especialista en herramientas digitales aplicadas al transporte y la logística","C19_PR/22/00020-P02_L1_C19-20221102-1","AF-UCLM2",25,25,0,5,50,15,15,5,10,95,240000,240000,240000]
[4,"C19_PR/22/00020","UNIVERSIDAD DE CASTILLA-LA MANCHA","Q1368009E","AF03","Energías Renovables y Ciudades Inteligentes en el Ámbito del Transporte y la Movilidad","C19_PR/22/00020-P03_L1_C19-20221102-1","AF-UCLM3",25,25,0,5,50,15,15,5,10,95,240000,240000,240000]
[17,"C19_PR/22/00022","UNIVERSIDAD POLITÉCNICA DE CARTAGENA","Q8050013E","AF01","Curso de Aplicaciones para la digitalización en materia de movilidad urbana sostenible","C19_PR/22/00022-P01_L1_C19-20221101-1"," DIGIMOV-UPCT",25,25,10,5,50,0,10,10,10,80,94330,94330,94330]
[29,"C19_PR/22/00023","UNIVERSIDAD NACIONAL DE EDUCACIÓN A DISTANCIA (UNED)","Q2818016D","AF01","Competencias digitales para el sector de movilidad y el transporte","C19_PR/22/00023-P01_L1_C19-20221031-1","UNED1",25,25,10,5,50,0,5,5,10,70,165000,165000,165000]
[24,"C19_PR/22/00023","UNIVERSIDAD NACIONAL DE EDUCACIÓN A DISTANCIA (UNED)","Q2818016D","AF02","Tecnologías y herramientas claves para la transformación digital en el sector del transporte, movilidad y logística","C19_PR/22/00023-P02_L1_C19-20221031-1","UNED2",25,25,0,5,50,0,10,5,10,75,90000,90000,90000]
[33,"C19_PR/22/00023","UNIVERSIDAD NACIONAL DE EDUCACIÓN A DISTANCIA (UNED)","Q2818016D","AF03","Digitalización sostenible en el sector transporte, movilidad, logística e infraestructuras vinculadas. Automatización, marketing y aplicación","C19_PR/22/00023-P03_L1_C19-20221031-1","UNED3",25,25,10,5,50,0,5,0,10,65,75000,75000,75000]
[23,"C19_PR/22/00024","UNIVERSIDAD POLITÉCNICA DE MADRID","Q2818015F","AF02","Programación Informática orientada a la Gestión y el Mantenimiento del Sector Transporte, la Logística y sus Infraestructuras Vinculadas","C19_PR/22/00024-P02_L1_C19-20221028-1","UPM-AF-08-P",25,10,10,5,50,15,0,0,10,75,34161,34161,34161]
[12,"C19_PR/22/00026","UNIVERSIDAD POLITÉCNICA DE MADRID","Q2818015F","AF01","Tecnologías y herramientas para la digitalización del transporte, la logística y sus infraestructuras","C19_PR/22/00026-P01_L1_C19-20221031-1","UPM-AF-01-R",25,25,0,5,50,0,15,10,10,85,216000,216000,216000]
[12,"C19_PR/22/00026","UNIVERSIDAD POLITÉCNICA DE MADRID","Q2818015F","AF02","Digitalización de los vehículos, la movilidad y su gestión","C19_PR/22/00026-P02_L1_C19-20221031-1","UPM-AF-02-R",25,25,10,5,50,0,15,10,10,85,216000,216000,216000]
[9,"C19_PR/22/00026","UNIVERSIDAD POLITÉCNICA DE MADRID","Q2818015F","AF03","Data Science para el Control de Riesgos en el Diseño y Mantenimiento de Infraestructuras Lineales","C19_PR/22/00026-P03_L1_C19-20221031-1","UPM-AF-03-M",25,25,0,5,50,15,10,5,10,90,150480,150480,150480]
[22,"C19_PR/22/00026","UNIVERSIDAD POLITÉCNICA DE MADRID","Q2818015F","AF04","Digitalización del mantenimiento de estructuras: captación, gestión y análisis de datos para la toma de decisiones","C19_PR/22/00026-P04_L1_C19-20221031-1","UPM-AF-04-P",25,25,0,5,50,15,5,5,0,75,60000,60000,60000]
[14,"C19_PR/22/00026","UNIVERSIDAD POLITÉCNICA DE MADRID","Q2818015F","AF05","Metodología BIM para el diseño, gestión y explotación en el sector transporte","C19_PR/22/00026-P05_L1_C19-20221031-1"," UPM-AF-05-P",25,10,0,5,40,15,10,10,10,85,99612,99612,99612]
[8,"C19_PR/22/00027","UNIVERSIDAD DE LA LAGUNA","Q3818001D","AF01","Competencias esenciales para la digitalización y transformación digital del transporte y la logística en Canarias","C19_PR/22/00027-P01_L1_C19-20221031-1","AF1",25,25,0,0,50,15,10,5,10,90,171000,171000,171000]
[28,"C19_PR/22/00027","UNIVERSIDAD DE LA LAGUNA","Q3818001D","AF02","Competencias digitales para el liderazgo y la dirección en tecnologías habilitadoras para la transformación digital del transporte y la logística en Canarias","C19_PR/22/00027-P02_L1_C19-20221031-1","AF2",25,25,0,0,50,15,5,0,0,70,100000,100000,100000]
[37,"C19_PR/22/00028","UNIVERSIDAD DE CANTABRIA","Q3918001C","AF03","Experto en digitalización y transformación digital del comercio y transporte internacional","C19_PR/22/00028-P03_L1_C19-20221031-1"," P03_L1_C19-20221031-1",25,0,10,5,40,15,5,0,0,60,48600,48600,48600]
[38,"C19_PR/22/00028","UNIVERSIDAD DE CANTABRIA","Q3918001C","AF04","Especialista en digitalización y transformación digital de logística","C19_PR/22/00028-P04_L1_C19-20221031-1"," P04_L1_C19-20221031-1",25,0,0,5,30,15,5,0,10,60,51000,51000,51000]
[13,"C19_PR/22/00029","UNIVERSIDAD DE CORDOBA","Q1418001B","AF01","Industria 4.0 e IoT aplicado al sector del transporte. operación y mantenimiento de las infraestructuras vinculadas","C19_PR/22/00029-P01_L1_C19-20221103-1","UCOAFCD01",25,10,0,5,40,15,15,5,10,85,200000,200000,200000]
[13,"C19_PR/22/00029","UNIVERSIDAD DE CORDOBA","Q1418001B","AF03","Mantenimiento Predictivo","C19_PR/22/00029-P03_L1_C19-20221103-1","UCOAFCD03",25,10,0,5,40,15,15,5,10,85,200000,200000,200000]
[25,"C19_PR/22/00035","UNIVERSIDAD DE HUELVA","Q7150008F","AF01","Digitalización y transformación digital en el sector del transporte y la logística","C19_PR/22/00035-P01_L1_C19-20221103-1","P01_L1_C19-20221103-1",25,25,10,5,50,0,10,5,10,75,150300,150300,150300]
[31,"C19_PR/22/00036","UNIVERSIDAD DE MURCIA","Q3018001B","AF01","Movilidad activa y saludable y transporte público autónomo y sostenible","C19_PR/22/00036-P01_L1_C19-20221103-1","PRTR – CMT – AF1",25,0,10,5,40,0,10,10,10,70,90000,90000,90000]
[39,"C19_PR/22/00036","UNIVERSIDAD DE MURCIA","Q3018001B","AF03","La Era Digital en el transporte: retos jurídico-tributarios de la transformación digital del sector del transporte","C19_PR/22/00036-P03_L1_C19-20221103-1"," PRTR – CMT – AF3",25,0,0,5,30,0,10,5,10,55,90000,90000,90000]
[19,"C19_PR/22/00038","UNIVERSIDADE DE VIGO","Q8650002B","AF01","Innovación en el Modelo de Negocio de la Nueva Movilidad","C19_PR/22/00038-P01_L1_C19-20221103-1","ACES4Future",25,0,10,5,40,15,10,5,10,80,157500,157500,157500]
[35,"C19_PR/22/00038","UNIVERSIDADE DE VIGO","Q8650002B","AF03","Digitalización logística","C19_PR/22/00038-P03_L1_C19-20221103-1","DIGILOG",25,0,0,5,30,15,5,5,10,65,93150,93150,93150]
[16,"C19_PR/22/00039","UNIVERSITAT POLITÈCNICA DE CATALUNYA","Q0818003F","AF01","Ciberseguridad en redes ferroviarias","C19_PR/22/00039-P01_L1_C19-20221103-1","EPSEVG5",25,25,0,5,50,15,5,0,10,80,105000,105000,105000]
[15,"C19_PR/22/00039","UNIVERSITAT POLITÈCNICA DE CATALUNYA","Q0818003F","AF02","Ciencia de Datos para Movilidad y Transporte","C19_PR/22/00039-P02_L1_C19-20221103-1","FIB1",25,25,0,5,50,15,15,0,0,80,210000,210000,210000]
[20,"C19_PR/22/00039","UNIVERSITAT POLITÈCNICA DE CATALUNYA","Q0818003F","AF03","La ciberseguridad en nuestras ciudades","C19_PR/22/00039-P03_L1_C19-20221103-1","FIB2",25,25,0,5,50,15,10,0,0,75,157500,157500,157500]
[20,"C19_PR/22/00039","UNIVERSITAT POLITÈCNICA DE CATALUNYA","Q0818003F","AF04","Impacto de las tecnologías Cloud en el sector del transporte y la logística","C19_PR/22/00039-P04_L1_C19-20221103-1","FIB3",25,25,0,5,50,15,10,0,0,75,157500,157500,157500]
[7,"C19_PR/22/00039","UNIVERSITAT POLITÈCNICA DE CATALUNYA","Q0818003F","AF05","Robótica aplicada al Transporte y la logística","C19_PR/22/00039-P05_L1_C19-20221103-1","FIB4",25,25,0,5,50,15,15,0,10,90,210000,210000,210000]
[7,"C19_PR/22/00039","UNIVERSITAT POLITÈCNICA DE CATALUNYA","Q0818003F","AF06","Inteligencia Artificial aplicada al Transporte y la Logística","C19_PR/22/00039-P06_L1_C19-20221103-1","FIB5",25,25,0,5,50,15,15,0,10,90,210000,210000,210000]
[16,"C19_PR/22/00040","UNIVERSITAT POLITÈCNICA DE CATALUNYA","Q0818003F","AF03","Metaverso y movilidad. Cómo aplicar las ventajas del metaverso en la mejora de la movilidad","C19_PR/22/00040-P03_L1_C19-20221103-1","EPSEVG3",25,25,0,5,50,15,5,0,10,80,105000,105000,105000]
[40,"C19_PR/22/00041","UNIVERSIDAD INTERNACIONAL ISABEL I DE CASTILLA","A09515412","AF01","Curso experto en Inteligencia Artificial Aplicado al Transporte y la logística","C19_PR/22/00041-P01_L1_C19-20221103-1","FCYT01",25,0,0,0,25,0,15,5,10,55,144335,144335,144335]
[40,"C19_PR/22/00041","UNIVERSIDAD INTERNACIONAL ISABEL I DE CASTILLA","A09515412","AF03","Curso experto en Movilidad Inteligente: Smart Mobility","C19_PR/22/00041-P03_L1_C19-20221103-1","FCYT03",25,0,0,0,25,0,15,5,10,55,144335,144335,144335]
[40,"C19_PR/22/00041","UNIVERSIDAD INTERNACIONAL ISABEL I DE CASTILLA","A09515412","AF04","Curso experto en Infraestructuras Inteligentes: Smart Cities","C19_PR/22/00041-P03_L1_C19-20221103-2","FCYT04",25,0,0,0,25,0,15,5,10,55,144335,144335,144335]
[40,"C19_PR/22/00041","UNIVERSIDAD INTERNACIONAL ISABEL I DE CASTILLA","A09515412","AF06","Curso experto en Visualización y Análisis de Datos del ámbito de la logística y el transporte","C19_PR/22/00041-P06_L1_C19-20221103-1","FCYT06",25,0,0,0,25,0,15,5,10,55,144335,144335,144335]
[40,"C19_PR/22/00041","UNIVERSIDAD INTERNACIONAL ISABEL I DE CASTILLA","A09515412","AF08","Curso experto Arquitecturas Big Data en HADOOP y SPARK en el Sector Logístico","C19_PR/22/00041-P02_L1_C19-20221103-2","FCYT08",25,0,0,0,25,0,15,5,10,55,144335,144335,144335]
[40,"C19_PR/22/00041","UNIVERSIDAD INTERNACIONAL ISABEL I DE CASTILLA","A09515412","AF09","Curso experto en Ciberseguridad para PYMES: Comercio electrónico seguro en ámbito del Transp. y la Log","C19_PR/22/00041-P03_L1_C19-20221103-3","FCYT09",25,0,0,0,25,0,15,5,10,55,144335,144335,144335]
[6,"C19_PR/22/00042","UNIVERSITAT POLITÈCNICA DE CATALUNYA","Q0818003F","AF01","Sistemas de Transporte Inteligente","C19_PR/22/00042-P01_L1_C19-20221103-1","ETSETB1",25,25,0,5,50,15,15,10,0,90,210000,210000,210000]
[]
[{"$f":"COUNTA(A3:A63)","v":61},null,null,null,null,null,null,null,null,null,null,null,null,null,null,null,null,null,null,null,{"$f":"SUM(U3:U63)","v":9903354.6400000006}]

{"sheet":"Exp Únicos","index":2,"n_rows":23,"n_cols":5,"rows_kept":23,"cut":false,"hidden":true,"merged":[]}
["Expediente"]
["C19_PR/22/00006",null,null,null,{"$f":"_xlfn._xlws.FILTER('RES_AF subv'!$B$3:$G$63,'RES_AF subv'!$B$3:$B$63=Formulario!$C$8)","v":{"$error":"#VALUE!"}}]
["C19_PR/22/00007"]
["C19_PR/22/00009"]
["C19_PR/22/00011"]
["C19_PR/22/00014"]
["C19_PR/22/00016"]
["C19_PR/22/00018"]
["C19_PR/22/00020"]
["C19_PR/22/00022"]
["C19_PR/22/00023"]
["C19_PR/22/00024"]
["C19_PR/22/00026"]
["C19_PR/22/00027"]
["C19_PR/22/00028"]
["C19_PR/22/00029"]
["C19_PR/22/00035"]
["C19_PR/22/00036"]
["C19_PR/22/00038"]
["C19_PR/22/00039"]
["C19_PR/22/00040"]
["C19_PR/22/00041"]
["C19_PR/22/00042"]